Bicyclo[2.2.1]heptane, 2-iodo-, exo-
- Formula: C7H11I
- Molecular weight: 222.0667
- IUPAC Standard InChIKey: IUXVGOYYSBDCSW-KPGICGJXSA-N
- CAS Registry Number: 30983-85-8
- Chemical structure:
View 3d structure (requires JavaScript / HTML 5) - Stereoisomers:

Gas phase ion energetics data

Data compiled as indicated in comments:
LBLHLM - Sharon G. Lias, John E. Bartmess, Joel F. Liebman, John L. Holmes, Rhoda D. Levin, and W. Gary Mallard
Ionization energy determinations
IE (eV) | Method | Reference | Comment |
---|---|---|---|
9.00 | EI | Honegger, Heilbronner, et al., 1984 | LBLHLM |
Appearance energy determinations
Ion | AE (eV) | Other Products | Method | Reference | Comment |
---|---|---|---|---|---|
C7H11+ | 8.90 | I | EI | Lossing and Holmes, 1984 | LBLHLM |

References

Honegger, Heilbronner, et al., 1984
Honegger, E.; Heilbronner, E.; Dratva, A.; Grob, C.A.,
197. 'lone pair' and 'CI bond' ionization energies of exo- and endo-2-norbornyl idides,
Helv. Chim. Acta, 1984, 67, 1691. [all data]
Lossing and Holmes, 1984
Lossing, F.P.; Holmes, J.L.,
Stabilization energy and ion size in carbocations in the gas phase,
J. Am. Chem. Soc., 1984, 106, 6917. [all data]