2-Norbornyl radical
- Formula: C7H11
- Molecular weight: 95.1622
- IUPAC Standard InChIKey: WVKPYYLOFMTDHB-UHFFFAOYSA-N
- CAS Registry Number: 30967-37-4
- Chemical structure:
View 3d structure (requires JavaScript / HTML 5) - Permanent link for this species. Use this link for bookmarking this species for future reference.

Gas phase ion energetics data

Data compiled as indicated in comments:
LLK - Sharon G. Lias, Rhoda D. Levin, and Sherif A. Kafafi
Ionization energy determinations
IE (eV) | Method | Reference | Comment |
---|---|---|---|
6.84 | PI | Houle and Beauchamp, 1979 | LLK |

References

Houle and Beauchamp, 1979
Houle, F.A.; Beauchamp, J.L.,
Photoelectron spectroscopy of methyl, ethyl, isopropyl, and tert-butyl radicals. Implications for the thermochemistry and structures of the radicals and their corresponding carbonium ions,
J. Am. Chem. Soc., 1979, 101, 4067. [all data]