1-Propene, 3,3-diethoxy-

Kovats' RI, non-polar column, isothermal

View large format table.

Column type Active phase Temperature (C) I Reference Comment
PackedApiezon L120.768.Bogoslovsky, Anvaer, et al., 1978Celite 545
PackedApiezon L160.772.Bogoslovsky, Anvaer, et al., 1978Celite 545

Normal alkane RI, non-polar column, custom temperature program

View large format table.

Column type Active phase I Reference Comment
CapillaryOV-101780.Zenkevich and Malamakhov, 1987He; Column length: 50. m; Column diameter: 0.24 mm; Program: not specified

References

Bogoslovsky, Anvaer, et al., 1978
Bogoslovsky, Yu.N.; Anvaer, B.I.; Vigdergauz, M.S., Chromatographic constants in gas chromatography (in Russian), Standards Publ. House, Moscow, 1978, 192. [all data]

Zenkevich and Malamakhov, 1987
Zenkevich, I.G.; Malamakhov, A.C., Evaluation of Molecular Weights of Organic Compounds based on Retention Parameters at Chromato-Spectral Analysys. Additional Criterion of Molecular Ions' Identification, Vestn. St. Petersb. Univ. Ser. 4: Fiz. Khim, 1987, 2, 101-106. [all data]