2-Imidazoline, 2-(o-methylbenzyl)-

Gas phase ion energetics data

Data compiled by: Sharon G. Lias, Rhoda D. Levin, and Sherif A. Kafafi

Ionization energy determinations

IE (eV) Method Reference Comment
8.60PEDe Jong and van Dam, 1979Vertical value

References

De Jong and van Dam, 1979
De Jong, A.P.; van Dam, H., Ultraviolet photoelectron spectroscopy of cyclic amidines. 1. Electronic structure of some α-adrenergic benzylimidazolines, J. Med. Chem., 1979, 22, 1290. [all data]