Disparlure

Kovats' RI, non-polar column, isothermal

View large format table.

Column type Active phase Temperature (C) I Reference Comment
PackedApiezon L190.1990.Nedopekina, Kovalev, et al., 1981N2, Chromatron N-AW-HMDS; Column length: 2.5 m

Van Den Dool and Kratz RI, non-polar column, custom temperature program

View large format table.

Column type Active phase I Reference Comment
CapillaryDB-52028.Gries R., Khaskin G., et al., 2005Column length: 30. m; Column diameter: 0.25 mm; Program: not specified

Normal alkane RI, non-polar column, custom temperature program

View large format table.

Column type Active phase I Reference Comment
CapillaryDB-52032.Gries, Schaefer, et al., 200130. m/0.25 mm/0.32 μm; Program: not specified

References

Nedopekina, Kovalev, et al., 1981
Nedopekina, S.F.; Kovalev, B.G.; Kost, A.N., Use of Kovats indices for idetifying sex pheromones, Chem. Nat. Compd. (Engl. Transl.), 1981, 17, 4, 376-380, https://doi.org/10.1007/BF01185272 . [all data]

Gries R., Khaskin G., et al., 2005
Gries R.; Khaskin G.; Schaefer P.; Hahn R.; Gotoh T.; Gries G., (7R,8S)-cis-7,8-epoxy-2-methyloctadec-17-ene: A novel trace component from the sex pheromone gland of gypsy moth, Lymantria dispar, J. Chem. Ecol., 2005, 31, 1, 49-62, https://doi.org/10.1007/s10886-005-0973-5 . [all data]

Gries, Schaefer, et al., 2001
Gries, G.; Schaefer, P.W.; Gries, R.; Liska, J.; Gotoh, T., Reproductive character displacement in Lymantria monacha from Northern Japan, J. Chem. Ecol., 2001, 27, 6, 1163-1176, https://doi.org/10.1023/A:1010316029165 . [all data]