2,3,4-Trimethyllevoglucosan
- Formula: C9H16O5
- Molecular weight: 204.2203
- IUPAC Standard InChIKey: ZZSLTIGBKYUBSG-WUNNTHRKSA-N
- CAS Registry Number: 2951-86-2
- Chemical structure:
View 3d structure (requires JavaScript / HTML 5) - Other names: 1,6-Anhydro-β-D-glucose, trimethyl ether

Van Den Dool and Kratz RI, non-polar column, custom temperature program

Column type | Active phase | I | Reference | Comment |
---|---|---|---|---|
Capillary | VF-5MS | 1403.9 | Tret'yakov, 2007 | 30. m/0.25 mm/0.25 μm, He; Program: Multi-step temperature program; T(initial)=60C; T(final)=270C |

References

Tret'yakov, 2007
Tret'yakov, K.V.,
Retention Data. NIST Mass Spectrometry Data Center., NIST Mass Spectrometry Data Center, 2007. [all data]