1,1-Diethyl-1,2,3,4-tetrahydronaphthalene
- Formula: C14H20
- Molecular weight: 188.3086
- IUPAC Standard InChIKey: DBFQMDNLSBZPMF-UHFFFAOYSA-N
- CAS Registry Number: 2938-66-1
- Chemical structure:
View 3d structure (requires JavaScript / HTML 5) - Other names: Naphthalene, 1,1-diethyl-1,2,3,4-tetrahydro

Van Den Dool and Kratz RI, non-polar column, temperature ramp

Column type | Active phase | I | Reference | Comment |
---|---|---|---|---|
Capillary | Petrocol DH | 1439. | White, Hackett, et al., 1992 | 100. m/0.25 mm/0.5 μm, He, 1. K/min; Tstart: 30. C; Tend: 220. C |

References

White, Hackett, et al., 1992
White, C.M.; Hackett, J.; Anderson, R.R.; Kail, S.; Spock, P.S.,
Linear temperature programmed retention indices of gasoline range hydrocarbons and chlorinated hydrocarbons on cross-linked polydimethylsiloxane,
J. Hi. Res. Chromatogr., 1992, 15, 2, 105-120, https://doi.org/10.1002/jhrc.1240150211
. [all data]