(R)-1-Methyl-4-(6-methylhept-5-en-2-yl)cyclohexa-1,4-diene

Normal alkane RI, non-polar column, custom temperature program

Data compiled by: NIST Mass Spectrometry Data Center, William E. Wallace, director

Column type CapillaryCapillaryCapillaryCapillaryCapillary
Active phase HP-5HP-5DB-5HP-5HP-5
Column length (m) 30.30.30.25.25.
Carrier gas HeliumHeliumHeliumHeliumHelium
Substrate
Column diameter (mm) 0.320.320.250.320.32
Phase thickness (μm) 0.250.250.250.170.17
Program not specifiednot specified50 0C m6 0C/min -> 140 0C 5 0C/min -> 160 0C (1 min) 10 0C/min -> 200 0C60 0C (5 min) 4 0C/min -> 220 0C 11 0C/min -> 280 0C (15 min)not specified
I 1516.1516.1512.1510.1515.
ReferenceKahriman, Tosun, et al., 2011Kahriman, Tosun, et al., 2010Courtois, Paine, et al., 2009Custer, 2009Custer, 2009
Comment MSDC-RI MSDC-RI MSDC-RI MSDC-RI MSDC-RI
Column type CapillaryCapillaryCapillaryCapillaryCapillary
Active phase SLB-5 MSDB-1CP-SilDB-5SE-52
Column length (m) 30.30.30.30.30.
Carrier gas HeliumHeHeliumHeliumHe
Substrate
Column diameter (mm) 0.250.250.250.250.32
Phase thickness (μm) 0.250.250.250.500.15
Program not specified45C => 3C/min => 175C => 15C/min => 300C (10min)50 0C (3 min) 3 0C/min -> 100 0C 2.7 0C/min -> 140 0C 2.4 0C/min -> 180 0C 6 0C/min -> 250 0C35 0C (6 min) 5 0C/min -> 50 0C 2 0C/min -> 70 0C 3 0C/min -> 150 0C 5 0C/min -> 200 0C45C => 1C/min => 100C => 5C/min => 250C (10min)
I 1516.1500.1506.1480.1516.
ReferenceLo Presti, Sciarrone, et al., 2008Nogueira, Marcelo-Curto, et al., 2008Proffit, 2007Soares, Pereira, et al., 2007Tognolini, Barocelli, et al., 2006
Comment MSDC-RI MSDC-RI MSDC-RI MSDC-RI MSDC-RI
Column type CapillaryCapillaryCapillaryCapillaryCapillary
Active phase DB-1HP-5SE-30CP-Sil 8CB-MSCP Sil 5 CB
Column length (m) 30.30. 50.25.
Carrier gas HeHe  N2
Substrate
Column diameter (mm) 0.250.25 0.320.25
Phase thickness (μm) 0.250.25  0.39
Program 45C => 3C/min => 175C => 15C/min => 300C (10min)50C (3min) => 3C/min => 150C (10min) => 10C/min => 250Cnot specified60C(1min) => 3C/min => 70C => 15C/min => 170C(8min) => 5C/min => 250Cnot specified
I 1500.1516.1493.1512.1502.
ReferenceFigueiredo, Sim-Sim, et al., 2005Tepe, Donmez, et al., 2004Vinogradov, 2004Mockute, Bernotiene, et al., 2003Weyerstahl, Marschall, et al., 1999
Comment MSDC-RI MSDC-RI MSDC-RI MSDC-RI MSDC-RI
Column type Capillary
Active phase DB-1
Column length (m) 30.
Carrier gas He
Substrate
Column diameter (mm) 0.25
Phase thickness (μm) 0.25
Program 45C => 3C/min => 175C => 15C/min => 240C (10min)
I 1500.
ReferenceBaratta, Dorman, et al., 1998
Comment MSDC-RI

Normal alkane RI, non-polar column, temperature ramp

Data compiled by: NIST Mass Spectrometry Data Center, William E. Wallace, director

Column type CapillaryCapillaryCapillaryCapillaryCapillary
Active phase HP-5HP-5HP-5SLB-5 MSDB-5
Column length (m) 30.30.30.30.30.
Carrier gas HeliumHeliumHydrogenHeliumHe
Substrate
Column diameter (mm) 0.320.320.250.250.25
Phase thickness (μm) 0.250.250.250.250.25
Tstart (C) 60.60.70.50.60.
Tend (C) 240.240.290.250.240.
Heat rate (K/min) 3.3.5.3.2.
Initial hold (min) 2.2. 2.
Final hold (min)    10.
I 1518.1518.1517.1512.1504.
ReferenceKahriman, Tosun, et al., 2011Kahriman, Tosun, et al., 2010Radulovic, Dordevic, et al., 2010Lo Presti, Sciarrone, et al., 2008Miyazawa and Tamura, 2007
Comment MSDC-RI MSDC-RI MSDC-RI MSDC-RI MSDC-RI
Column type CapillaryCapillaryCapillaryCapillaryCapillary
Active phase HP-5DB-5MSHP-5HP-5MSSPB-5
Column length (m) 25.30.30.30.60.
Carrier gas HeHeHeHeHe
Substrate
Column diameter (mm) 0.250.250.250.250.32
Phase thickness (μm) 0.250.250.250.251.
Tstart (C) 50.60.70.60.60.
Tend (C) 300.280.240.280.200.
Heat rate (K/min) 5.3.5.3.4.
Initial hold (min) 5.
Final hold (min)  30.  30.
I 1516.1508.1514.1506.1519.
ReferenceChampagnat, Figueredo, et al., 2006Maronigiu, Piras, et al., 2006Oyedeji, Yani, et al., 2005Slavkovska, Couladis, et al., 2005Gauvin, Ravaomanarivo, et al., 2004
Comment MSDC-RI MSDC-RI MSDC-RI MSDC-RI MSDC-RI
Column type CapillaryCapillaryCapillaryCapillaryCapillary
Active phase HP-5DB-5SPB-5Optima-5DB-5
Column length (m) 30.30.60.30.30.
Carrier gas HeHeHeHeHelium
Substrate
Column diameter (mm) 0.250.250.320.20.25
Phase thickness (μm) 0.250.25  0.25
Tstart (C) 60.60.40.50.60.
Tend (C) 280.240.220.250.240.
Heat rate (K/min) 3.3.3.3.3.
Initial hold (min)   5.3.
Final hold (min)   15.
I 1492.1511.1513.1514.1510.
ReferencePitarokili, Tzakou, et al., 2003Zoghbi, Andrade, et al., 2003Cornu, Carnat, et al., 2001Jacquemond-Collet, Bessière, et al., 2001Tellez, Estell, et al., 1997
Comment MSDC-RI MSDC-RI MSDC-RI MSDC-RI MSDC-RI

Van Den Dool and Kratz RI, non-polar column, temperature ramp

Data compiled by: NIST Mass Spectrometry Data Center, William E. Wallace, director

Column type CapillaryCapillaryCapillaryCapillaryCapillary
Active phase RTX-1DB-5DB-5BP-1DB-1
Column length (m) 60.25.30.50.30.
Carrier gas HeHeHeHeN2
Substrate
Column diameter (mm) 0.220.250.250.220.25
Phase thickness (μm) 0.250.250.250.250.25
Tstart (C) 60.60.60.60.50.
Tend (C) 230.200.260.220.220.
Heat rate (K/min) 2.2.5.2.4.
Initial hold (min)
Final hold (min) 35.60. 20.
I 1507.1510.1516.1501.1510.
ReferencePaolini, Muselli, et al., 2007Rout, Rao, et al., 2007Sabulal, Dan, et al., 2007Gonny, Cavaleiro, et al., 2006Kuiate, Bessière, et al., 2006
Comment MSDC-RI MSDC-RI MSDC-RI MSDC-RI MSDC-RI
Column type CapillaryCapillaryCapillaryCapillaryCapillary
Active phase RTX-1CP Sil 5 CBBP-1HP-5RTX-1
Column length (m) 60.25.50.30.60.
Carrier gas HeHeHeHeHe
Substrate
Column diameter (mm) 0.220.250.220.250.22
Phase thickness (μm) 0.250.40.25 0.25
Tstart (C) 60.80.60.60.60.
Tend (C) 230.270.220.260.230.
Heat rate (K/min) 2.10.2.3.2.
Initial hold (min)
Final hold (min) 35. 20. 45.
I 1498.1503.1502.1512.1503.
ReferencePaolini J., Desjobert J.M., et al., 2006Ziegenbein, Hanssen, et al., 2006Boti J.B., Koukoua G., et al., 2005Javidnia, Miri, et al., 2004Cavalli, Tomi, et al., 2003
Comment MSDC-RI MSDC-RI MSDC-RI MSDC-RI MSDC-RI
Column type CapillaryCapillaryCapillaryCapillary
Active phase HP-5DB-5DB-5DB-5
Column length (m) 30.30.30.30.
Carrier gas HeHeH2He
Substrate
Column diameter (mm) 0.250.250.250.25
Phase thickness (μm) 0.250.250.250.25
Tstart (C) 60.60.60.60.
Tend (C) 280.300.240.300.
Heat rate (K/min) 4.5.3.5.
Initial hold (min) 5.3. 3.
Final hold (min)
I 1512.1516.1517.1516.
ReferenceSkaltsa, Demetzos, et al., 2003Bortolomeazzi, Berno, et al., 2001Nogueira, Bittrich, et al., 2001Bortolomeazzi, Pizzale, et al., 2000
Comment MSDC-RI MSDC-RI MSDC-RI MSDC-RI

Kovats' RI, non-polar column, temperature ramp

Data compiled by: NIST Mass Spectrometry Data Center, William E. Wallace, director

Column type CapillaryCapillaryCapillaryCapillaryCapillary
Active phase HP-5MSDB-5BP-1SE-54DB-5
Column length (m) 30.30.25.30.30.
Carrier gas HeHeN2 He
Substrate
Column diameter (mm) 0.250.250.550.260.26
Phase thickness (μm) 0.250.250.250.250.25
Tstart (C) 60.60.60.60.60.
Tend (C) 200. 220.246.246.
Heat rate (K/min) 4.3.5.3.3.
Initial hold (min) 1.
Final hold (min) 15. 15.
I 1509.1512.1510.1512.1512.
ReferenceJuliani, Zygadlo, et al., 2004Lucero, Estell, et al., 2003Raina, Srivastava, et al., 2002Adams, 2000Adams, 2000, 2
Comment MSDC-RI MSDC-RI MSDC-RI MSDC-RI MSDC-RI
Column type Capillary
Active phase DB-5
Column length (m) 30.
Carrier gas He
Substrate
Column diameter (mm) 0.25
Phase thickness (μm) 0.25
Tstart (C) 60.
Tend (C) 240.
Heat rate (K/min) 3.
Initial hold (min)
Final hold (min)
I 1517.
Referenceda Silva, Andrade, et al., 1999
Comment MSDC-RI

Van Den Dool and Kratz RI, polar column, custom temperature program

Data compiled by: NIST Mass Spectrometry Data Center, William E. Wallace, director

Column type CapillaryCapillary
Active phase Carbowax 20MCarbowax 20M
Column length (m) 30.30.
Carrier gas HeHe
Substrate
Column diameter (mm) 0.250.25
Phase thickness (μm) 0.250.25
Program 60C(3min) => 4C/min => 160C => 10C/min => 280C60C(3min) => 4C/min => 160C => 10C/min => 280C
I 1741.1741.
ReferenceBortolomeazzi, Berno, et al., 2001Bortolomeazzi, Pizzale, et al., 2000
Comment MSDC-RI MSDC-RI

Normal alkane RI, polar column, custom temperature program

Data compiled by: NIST Mass Spectrometry Data Center, William E. Wallace, director

Column type CapillaryCapillary
Active phase HP-Innowax FSCCarbowax 20M
Column length (m) 60.
Carrier gas He
Substrate
Column diameter (mm) 0.25
Phase thickness (μm) 0.25
Program 60C(10min) => 4C/min => 220C(10min) => 1C/min => 240Cnot specified
I 1755.1756.
ReferenceViljoen, Subramoney, et al., 2005Vinogradov, 2004
Comment MSDC-RI MSDC-RI

References

Kahriman, Tosun, et al., 2011
Kahriman, N.; Tosun, G.; Terzioglu, S.; Karaoglu, S.A.; Yayh, N., Chemical composition and antimicrobial activity of the essential oils from the flower, leaf, and stem of Senecio pandurifolis, Rec. Nat. Prod., 2011, 5, 2, 82-91. [all data]

Kahriman, Tosun, et al., 2010
Kahriman, N.; Tosun, G.; Genc, H.; Yayli, N., Comparative essential oil analysis of Geranium sylvaticum estracted by hydrodistillation and microwave distillation, Turk. J. Chem., 2010, 34, 969-976. [all data]

Courtois, Paine, et al., 2009
Courtois, E.A.; Paine, C.E.; Blandinieres, P.-A.; Stien, D.; Bessiere, J.-M.; Houel, E.; Baraloto, C.; Chave, J., Diversity of the volatile organic compounds emitted by 55 species of tropical trees: a survey in French Guiana, J. Chem. Ecol., 2009, 35, 11, 1349-1362, https://doi.org/10.1007/s10886-009-9718-1 . [all data]

Custer, 2009
Custer, Y., GC Volatile Components Analysis of Different Parts of Litchi chinensis (Dissertation), 2009. [all data]

Lo Presti, Sciarrone, et al., 2008
Lo Presti, M.; Sciarrone, D.; Crupi, M.C.; Costa, R.; Ragusa, S.; Dugo, G.; Mondello, L., Evaliation of the volatile and chiral composition in Pistacia lentiscus L. essential oil, Flavour Fragr. J., 2008, 23, 4, 249-257, https://doi.org/10.1002/ffj.1878 . [all data]

Nogueira, Marcelo-Curto, et al., 2008
Nogueira, T.; Marcelo-Curto, M.J.; Cristina Figueiredo, A.; Barroso, J.G.; Pedro, L.G.; Rubiolo, P.; Bicchi, C., Chemotaxonomy of Hypericum genus from Portugal: Geographical distribution and essential oils composition of Hypericum perfoliatum, Hypericum humifusum, Hypericum linarifolium and Hypericum pulchrum, Biochem. Syst. Ecol., 2008, 36, 1, 40-50, https://doi.org/10.1016/j.bse.2007.07.004 . [all data]

Proffit, 2007
Proffit, M., Mediation chimique et structuration des communautes d'hymenopteres parasites du mutualisme figuier / pollinisateur (These pour obtenir le grade de Docteur de l'Universite Montpellier II) (Dissertation), 2007. [all data]

Soares, Pereira, et al., 2007
Soares, F.D.; Pereira, T.; Marques, M.O.M.; Monteiro, A.R., Volatile and Non-volatile Chemical Composition of the White Guava fruit (Psidium guaiava) at different Stages of Maturity, Food Chem., 2007, 100, 1, 15-21, retrieved from http://www.aseanfood.info/Articles/11016448.pdf, https://doi.org/10.1016/j.foodchem.2005.07.061 . [all data]

Tognolini, Barocelli, et al., 2006
Tognolini, M.; Barocelli, E.; Ballabeni, V.; Bruni, R.; Bianchi, A.; Chiavarini, M.; Impicciatore, M., Comparative screening of plant essential oils: Phenylpropanoid moiety as basic core for antiplatelet activity, Life Sciences, 2006, 78, 13, 1419-1432, https://doi.org/10.1016/j.lfs.2005.07.020 . [all data]

Figueiredo, Sim-Sim, et al., 2005
Figueiredo, A.C.; Sim-Sim, M.; Costa, M.M.; Barroso, J.G.; Pedro, L.G.; Esquível, M.G.; Gutierres, F.; Lobo, C.; Fontinha, S., Comparison of the essential oil composition of four Plagiochila species: P. bifaria, P. maderensis, P. retrorsa and P. stricta, Flavour Fragr. J., 2005, 20, 6, 703-709, https://doi.org/10.1002/ffj.1627 . [all data]

Tepe, Donmez, et al., 2004
Tepe, B.; Donmez, E.; Unlu, M.; Candan, F.; Daferera, D.; Vardar-Unlu, G.; Polissiou, M.; Sokmen, A., Antimicrobial and antioxidative activities of the essential oils and methanol extracts of Salvia cryptantha (Montbret et Aucher ex Benth.) and Salvia multicaulis (Vahl), Food Chem., 2004, 84, 4, 519-525, https://doi.org/10.1016/S0308-8146(03)00267-X . [all data]

Vinogradov, 2004
Vinogradov, B.A., Production, composition, properties and application of essential oils, 2004, retrieved from http://viness.narod.ru. [all data]

Mockute, Bernotiene, et al., 2003
Mockute, D.; Bernotiene, G.; Judzentiene, A., Volatile compounds of the aerial parts of wild St. John's wort (Hypericum perforatum L.) plants, Chemija, 2003, 14, 3, 108-111. [all data]

Weyerstahl, Marschall, et al., 1999
Weyerstahl, P.; Marschall, H.; Eckhardt. A.; Christiansen, C., Constituents of commercial Brazilian Iantana oil, Flavour Fragr. J., 1999, 14, 1, 15-28, https://doi.org/10.1002/(SICI)1099-1026(199901/02)14:1<15::AID-FFJ777>3.0.CO;2-M . [all data]

Baratta, Dorman, et al., 1998
Baratta, M.T.; Dorman, H.J.; Deans, S.G.; Figueiredo, A.C.; Barroso, J.G.; Ruberto, G., Antimicrobial and antioxidant properties of some commercial essential oils, Flavour Fragr. J., 1998, 13, 4, 235-244, https://doi.org/10.1002/(SICI)1099-1026(1998070)13:4<235::AID-FFJ733>3.0.CO;2-T . [all data]