1,3,4-Oxadiazol-2(5H)-one,5,5-dimethyl-

Gas phase ion energetics data

Data compiled by: Sharon G. Lias, Rhoda D. Levin, and Sherif A. Kafafi

Ionization energy determinations

IE (eV) Method Reference Comment
10.20PEPaine and Werstiuk, 1978Vertical value

References

Paine and Werstiuk, 1978
Paine, A.J.; Werstiuk, N.H., SCF molecular orbitals and the photoelectron spectrum of 5,5-dimethyl-Δ3-1,3,4-oxadiazolin-2-one, Can. J. Chem., 1978, 56, 1319. [all data]