Bicyclo[3.2.2]nonane

Gas phase ion energetics data

Data compiled as indicated in comments:
LLK - Sharon G. Lias, Rhoda D. Levin, and Sherif A. Kafafi

Ionization energy determinations

IE (eV) Method Reference Comment
9.0PEGoldstein, Natowsky, et al., 1973LLK
9.6PEGoldstein, Natowsky, et al., 1973Vertical value; LLK

References

Goldstein, Natowsky, et al., 1973
Goldstein, M.J.; Natowsky, S.; Heilbronner, E.; Hornung, V., Near cancellation of through space and through bond interaction in bicyclo[3.2.2]nona-6,8-diene, Helv. Chim. Acta, 1973, 56, 294. [all data]