11,1-Metheno-1H-cyclohepta[b]heptalene,11a,12,13,13a-tetrahydro-

Gas phase ion energetics data

Data compiled by: Sharon G. Lias, Rhoda D. Levin, and Sherif A. Kafafi

Ionization energy determinations

IE (eV) Method Reference Comment
7.40 ± 0.05PEBatich, Heilbronner, et al., 1974Vertical value

References

Batich, Heilbronner, et al., 1974
Batich, C.; Heilbronner, E.; Vogel, E., The ionization energies of bridged [14]annulenes and of dicyclohepta[cd,gh]pentalene, Helv. Chim. Acta, 1974, 57, 2288. [all data]