7-Oxabicyclo[2.2.1]heptane

Gas phase ion energetics data

Data evaluated as indicated in comments:
HL - Edward P. Hunter and Sharon G. Lias

Data compiled as indicated in comments:
LLK - Sharon G. Lias, Rhoda D. Levin, and Sherif A. Kafafi

Quantity Value Units Method Reference Comment
Proton affinity (review)844.2kJ/molN/AHunter and Lias, 1998HL
Quantity Value Units Method Reference Comment
Gas basicity816.8kJ/molN/AHunter and Lias, 1998HL

Ionization energy determinations

IE (eV) Method Reference Comment
9.57 ± 0.02PEBain, Bunzli, et al., 1973Vertical value; LLK

References

Hunter and Lias, 1998
Hunter, E.P.; Lias, S.G., Evaluated Gas Phase Basicities and Proton Affinities of Molecules: An Update, J. Phys. Chem. Ref. Data, 1998, 27, 3, 413-656, https://doi.org/10.1063/1.556018 . [all data]

Bain, Bunzli, et al., 1973
Bain, A.D.; Bunzli, J.C.; Frost, D.C.; Weiler, L., Photoelectron spectra of cyclic ethers, J. Am. Chem. Soc., 1973, 95, 291. [all data]