1,5-Naphthyridine 1,5-dioxide

Gas phase ion energetics data

Data compiled by: Sharon G. Lias, Rhoda D. Levin, and Sherif A. Kafafi

Ionization energy determinations

IE (eV) Method Reference Comment
8.18 ± 0.05PEMaier, Muller, et al., 1975Vertical value

References

Maier, Muller, et al., 1975
Maier, J.P.; Muller, J.-F.; Kubota, T.; Yamakawa, M., 183. Ionisation energies and the electronic structures of the N-oxides of azanaphthalenes and azaanthracenes, Helv. Chim. Acta, 1975, 58, 1641. [all data]