1-Triethylsilyloxydecane

Normal alkane RI, non-polar column, custom temperature program

View large format table.

Column type Active phase I Reference Comment
CapillarySE-301790.Poole and Zlatkis, 1979Program: not specified

References

Poole and Zlatkis, 1979
Poole, C.F.; Zlatkis, A., Trialkylsilyl Ether Derivatives (Other Than TMS) for Gas Chromatography and Mass Spectrometry, J. Chromatogr. Sci., 1979, 17, 3, 115-123, https://doi.org/10.1093/chromsci/17.3.115 . [all data]