Methanesulfonyl chloride, trichloro-

Normal alkane RI, non-polar column, isothermal

View large format table.

Column type Active phase Temperature (C) I Reference Comment
PackedMethyl silicone130.1024.Seifert, Kalina, et al., 1976Nitrogen, Chromaton N AW (0.20-0.25 mm); Column length: 6.1 m
PackedMethyl silicone150.1035.Seifert, Kalina, et al., 1976Nitrogen, Chromaton N AW (0.20-0.25 mm); Column length: 6.1 m

Phase change data

Data compiled by: William E. Acree, Jr., James S. Chickos

Enthalpy of fusion

ΔfusH (kcal/mol) Temperature (K) Reference
1.78418.5Dou, Fuess, et al., 1994

References

Seifert, Kalina, et al., 1976
Seifert, R.; Kalina, J.; Sxec, P.; Zbirovsky, M., GasChromatographische bestimmung von chlorierten C1-sulfonylchloriden, Sbornik Vysoke skoly chemicko-technologicke v Prage, 1976, C23, 21-26. [all data]