Benzonitrile, 3-ethoxy-
- Formula: C9H9NO
- Molecular weight: 147.1739
- IUPAC Standard InChIKey: PFNAUBYHTWDKBO-UHFFFAOYSA-N
- CAS Registry Number: 25117-75-3
- Chemical structure:
View 3d structure (requires JavaScript / HTML 5) - Other names: Benzonitrile, m-ethoxy-; 3-Ethoxybenzonitrile; m-Ethoxy benzonitrile; 3-Ethoxybenzoic acid nitrile

Gas phase ion energetics data

Data compiled by: Henry M. Rosenstock, Keith Draxl, Bruce W. Steiner, and John T. Herron
Ionization energy determinations
IE (eV) | Method | Reference |
---|---|---|
8.92 ± 0.15 | EI | McLafferty and Schiff, 1969 |
Appearance energy determinations
Ion | AE (eV) | Other Products | Method | Reference | Comment |
---|---|---|---|---|---|
C7H5NO+ | 11.31 ± 0.15 | C2H4 | EI | McLafferty and Schiff, 1969 |

Phase change data

Data compiled by: Robert L. Brown and Stephen E. Stein
Quantity | Value | Units | Method | Reference | Comment |
---|---|---|---|---|---|
Tboil | 515.7 | K | N/A | Aldrich Chemical Company Inc., 1990 |

References

McLafferty and Schiff, 1969
McLafferty, F.W.; Schiff, L.J.,
The structure of [YC6H5O]+ ions in the spectra of aryl alkyl ethers,
Org. Mass Spectrom., 1969, 2, 757. [all data]