L-Isoleucine, N-(trifluoroacetyl)-, butyl ester

Van Den Dool and Kratz RI, non-polar column, temperature ramp

View large format table.

Column type Active phase I Reference Comment
CapillaryOV-1011358.Schneider, Neupert, et al., 1985H2, 3. K/min; Column length: 30. m; Column diameter: 0.33 mm; Tstart: 80. C; Tend: 280. C

References

Schneider, Neupert, et al., 1985
Schneider, K.; Neupert, M.; Spiteller, G.; Henning, H.V.; Matthaei, D.; Scheler, F., Gas Chromatography of Amino Acids in Urine and Haemofiltrate, J. Chromatogr., 1985, 345, 19-31, https://doi.org/10.1016/0378-4347(85)80131-6 . [all data]