Benzene, 1,1'-(2,2-dichloroethylidene)bis-

Kovats' RI, non-polar column, isothermal

View large format table.

Column type Active phase Temperature (C) I Reference Comment
PackedApiezon L215.1854.Heinzen and Yunes, 1992Chromosorb W; Column length: 1.8 m

References

Heinzen and Yunes, 1992
Heinzen, V.E.F.; Yunes, R.A., Relationship between gas chromatographic retention indices and molecular connectivity indices of chlorinated pesticides and structurally related compounds, J. Chromatogr., 1992, 598, 2, 243-250, https://doi.org/10.1016/0021-9673(92)85054-W . [all data]