6-Nonenal, (E)-
- Formula: C9H16O
- Molecular weight: 140.2227
- IUPAC Standard InChIKey: RTNPCOBSXBGDMO-ONEGZZNKSA-N
- CAS Registry Number: 2277-20-5
- Chemical structure:
View 3d structure (requires JavaScript / HTML 5) - Stereoisomers:
- Other names: trans-6-Nonenal; (E)-6-nonenal

Normal alkane RI, polar column, temperature ramp

Column type | Active phase | I | Reference | Comment |
---|---|---|---|---|
Capillary | TC-WAX | 1438. | Miyazawa, Tomita, et al., 2009 | Helium, 40. C @ 3. min, 3. K/min; Column length: 60. m; Column diameter: 0.25 mm; Tend: 230. C |
Capillary | Carbowax 20M | 1469. | Kawakami, Kobayashi, et al., 1993 | He, 60. C @ 4. min, 2. K/min; Column length: 50. m; Column diameter: 0.25 mm; Tend: 180. C |

Normal alkane RI, polar column, custom temperature program

Column type | Active phase | I | Reference | Comment |
---|---|---|---|---|
Capillary | CP Wax 52 CB | 1433. | Patterson and Stevenson, 1995 | 50. m/0.32 mm/0.20 μm; Program: 50 0C (10 min) 2 0C/min -> 100 0C 5 0C/min -> 150 0C 7 0C/min -> 220 0C (20 min) |

References

Miyazawa, Tomita, et al., 2009
Miyazawa, N.; Tomita, N.; Kurobayashi, Y.; Nakanishi, A.; Ohkubo, Y.; Maeda, T.; Fujita, A.,
Novel character impact compounds in Yuzu (Citrus junos Sieb. ex Tanaka) Peel oil,
J. Agric. Food Chem., 2009, 57, 5, 1990-1996, https://doi.org/10.1021/jf803257x
. [all data]
Kawakami, Kobayashi, et al., 1993
Kawakami, M.; Kobayashi, A.; Kator, K.,
Volatile constituents of Rooibos tea (Aspalathus linearis) as affected by extraction process,
J. Agric. Food Chem., 1993, 41, 4, 633-636, https://doi.org/10.1021/jf00028a023
. [all data]
Patterson and Stevenson, 1995
Patterson, R.L.S.; Stevenson, M.H.,
Irradiation-induced off-odor in chicken and its possible control,
British Poultry Science, 1995, 36, 3, 425-441, https://doi.org/10.1080/00071669508417789
. [all data]