Quinoline, 2,4,6-trimethyl-

Kovats' RI, non-polar column, isothermal

Data compiled by: NIST Mass Spectrometry Data Center, William E. Wallace, director

Column type CapillaryCapillaryCapillaryCapillary
Active phase OV-101OV-101OV-101OV-101
Column length (m)   50.50.
Carrier gas HeHeN2N2
Substrate
Column diameter (mm)   0.220.22
Phase thickness (μm)
Temperature (C) 140.160.140.160.
I 1525.1539.1525.1539.
ReferenceDmitrikov and Nabivach, 1995Dmitrikov and Nabivach, 1995Berlizov, Nabivach, et al., 1987Berlizov, Nabivach, et al., 1987
Comment MSDC-RI MSDC-RI MSDC-RI MSDC-RI

References

Dmitrikov and Nabivach, 1995
Dmitrikov, V.P.; Nabivach, V.M., Physico-chemical regularities of quinoline bases retention in gas chromatography, Coke Chem. (Engl. Transl.), 1995, 8, 27-34. [all data]

Berlizov, Nabivach, et al., 1987
Berlizov, Yu.S.; Nabivach, V.M.; Mitrikov, V.P., Capillary gas chromatography of alkylquinolines, Zh. Anal. Khim., 1987, 62, 6, 1119-1124. [all data]