Eicosanoic acid, hexadecyl ester

Normal alkane RI, non-polar column, temperature ramp

View large format table.

Column type Active phase I Reference Comment
CapillaryDB-1MS3746.49Stransky, Zarevucka, et al., 200630. m/0.252 mm/0.25 μm, H2, 1. K/min; Tstart: 240. C; Tend: 340. C

References

Stransky, Zarevucka, et al., 2006
Stransky, K.; Zarevucka, M.; Valterova, I.; Wimmer, Z., Gas chromatographic retention data of wax esters, J. Chromatogr. A, 2006, 1128, 1-2, 208-219, https://doi.org/10.1016/j.chroma.2006.06.035 . [all data]