1H-Pyrrole-3-carboxylic acid, 2,4-dimethyl-, ethyl ester

Gas phase ion energetics data

Data compiled as indicated in comments:
LLK - Sharon G. Lias, Rhoda D. Levin, and Sherif A. Kafafi

Ionization energy determinations

IE (eV) Method Reference Comment
7.95PECauletti, Giancaspro, et al., 1981Vertical value; LLK

Phase change data

Data compiled by: Robert L. Brown and Stephen E. Stein

Quantity Value Units Method Reference Comment
Tboil564.2KN/AWeast and Grasselli, 1989

Reduced pressure boiling point

Tboil (K) Pressure (bar) Reference
454.70.047Weast and Grasselli, 1989

References

Cauletti, Giancaspro, et al., 1981
Cauletti, C.; Giancaspro, C.; Monaci, A.; Piancastelli, M.N., Free energy relationships of ionization energies measured by ultraviolet photoelectron spectroscopy in substituted pyrroles, J. Chem. Soc. Perkin Trans. 2, 1981, 7, 656. [all data]