1,2-Indandione, 3,3-dimethyl-

Gas phase ion energetics data

Data compiled as indicated in comments:
LLK - Sharon G. Lias, Rhoda D. Levin, and Sherif A. Kafafi

Ionization energy determinations

IE (eV) Method Reference Comment
8.5PEArnett, Newkome, et al., 1974LLK
8.7PEArnett, Newkome, et al., 1974Vertical value; LLK

References

Arnett, Newkome, et al., 1974
Arnett, J.F.; Newkome, G.; Mattice, W.L.; McGlynn, S.P., Excited electronic states of the α-dicarbonyls, J. Am. Chem. Soc., 1974, 96, 4385. [all data]