Propanoic acid, 3,3,3-trichloro-, methyl ester
- Formula: C4H5Cl3O2
- Molecular weight: 191.440
- IUPAC Standard InChIKey: FBMIRDYZKMXRFO-UHFFFAOYSA-N
- CAS Registry Number: 20618-02-4
- Chemical structure:
View 3d structure (requires JavaScript / HTML 5) - Permanent link for this species. Use this link for bookmarking this species for future reference.

Kovats' RI, non-polar column, isothermal

Column type | Active phase | Temperature (C) | I | Reference | Comment |
---|---|---|---|---|---|
Capillary | OV-101 | 120. | 1015. | Evans, Haken, et al., 1986 | |
Capillary | OV-101 | 100. | 1018. | Haken and Korhonen, 1984 | N2; Column length: 25. m; Column diameter: 0.3 mm |
Capillary | OV-101 | 120. | 1015. | Haken and Korhonen, 1984 | N2; Column length: 25. m; Column diameter: 0.3 mm |
Capillary | OV-101 | 80. | 1017. | Haken and Korhonen, 1984 | N2; Column length: 25. m; Column diameter: 0.3 mm |

References

Evans, Haken, et al., 1986
Evans, M.B.; Haken, J.K.; Tóth, T.,
Solute characterization in gas chromatography by an extension of Kováts retention index system. Dispersion and selectivity indices,
J. Chromatogr., 1986, 351, 155-164, https://doi.org/10.1016/S0021-9673(01)83484-1
. [all data]
Haken and Korhonen, 1984
Haken, J.K.; Korhonen, I.O.O.,
Gas chromatography of homologous esters. XXIV. Studies of chlorinated methyl propanoates and butanoates on a non-polar capillary column,
J. Chromatogr., 1984, 284, 474-477, https://doi.org/10.1016/S0021-9673(01)87849-3
. [all data]