1,8-Nonadiene, 2,8-dimethyl-

Kovats' RI, non-polar column, isothermal

View large format table.

Column type Active phase Temperature (C) I Reference Comment
PackedSE-30150.1196.Casteignau and Villessot, 1968Column length: 3. m
PackedSE-30175.1166.Casteignau and Villessot, 1968Column length: 3. m

References

Casteignau and Villessot, 1968
Casteignau, G.; Villessot, D., Identification par chromatographie en phase gaseuse de composés difonctionnels insaturés. II. Relations entre les structures et les grandeurs chromatographiques, Bull. Soc. Chim. Fr., 1968, 9, 3904-3907. [all data]