Hexahelicene
- Formula: C26H16
- Molecular weight: 328.4052
- IUPAC Standard InChIKey: UOYPNWSDSPYOSN-UHFFFAOYSA-N
- CAS Registry Number: 187-83-7
- Chemical structure:
View 3d structure (requires JavaScript / HTML 5) - Other names: Phenanthro[3,4-c]phenanthrene; [6]Helicene

Normal alkane RI, non-polar column, isothermal

Column type | Active phase | Temperature (C) | I | Reference | Comment |
---|---|---|---|---|---|
Packed | OV-1 | 280. | 3260. | Nicoud, Balavoine, et al., 1972 | Nitrogen, Gas-Chrom Q |
Packed | OV-1 | 300. | 3320. | Nicoud, Balavoine, et al., 1972 | Nitrogen, Gas-Chrom Q |
Packed | OV-1 | 300. | 3335. | Nicoud, Balavoine, et al., 1972 | Nitrogen, Gas-Chrom Q |
Packed | OV-1 | 280. | 3260. | Nicoud, Moradpour, et al., 1972 | Nitrogen, Gas-Chrom Q (60-80 mesh); Column length: 4. m |
Packed | OV-1 | 300. | 3320. | Nicoud, Moradpour, et al., 1972 | Nitrogen, Gas-Chrom Q (60-80 mesh); Column length: 4. m |
Packed | OV-1 | 300. | 3335. | Nicoud, Moradpour, et al., 1972 | Nitrogen, Gas-Chrom Q (60-80 mesh); Column length: 4. m |

Lee's RI, non-polar column, custom temperature program

Column type | Active phase | I | Reference | Comment |
---|---|---|---|---|
Capillary | CP Sil 8 CB | 509.79 | Bemgard, Colmsjo, et al., 1992 | Column length: 25. m; Column diameter: 0.32 mm; Program: 140C (2min) => (rapidly) => 200C(2min) => 5C/min => 370C |
Capillary | XTI-5 | 509.74 | Bemgard, Colmsjo, et al., 1992 | Column length: 15. m; Column diameter: 0.28 mm; Program: 140C (2min) => (rapidly) => 200C(2min) => 5C/min => 370C |

Gas phase ion energetics data

Data compiled by: Sharon G. Lias, Rhoda D. Levin, and Sherif A. Kafafi
Ionization energy determinations
IE (eV) | Method | Reference | Comment |
---|---|---|---|
7.37 | PE | Obenland and Schmidt, 1975 | |
7.37 | PE | Obenland and Schmidt, 1975 | Vertical value |

References

Nicoud, Balavoine, et al., 1972
Nicoud, J.F.; Balavoine, G.; Kagan, H.; Martin, R.H.; Deblecker, M.,
Chromatographie en phase vapeur d'helicenes et de diaryl-1,2-ethylenes,
J. Chromatogr., 1972, 66, 1, 43-53, https://doi.org/10.1016/S0021-9673(01)82926-5
. [all data]
Nicoud, Moradpour, et al., 1972
Nicoud, J.F.; Moradpour, A.; Balavoine, G.; Kagan, H.; Martin, R.H.; Deblecker, M.,
Chromatographie en phase vapeur d'helicenes et de diaryl-1,2 ethylenes,
J. Chromatogr., 1972, 66, 1, 43-53, https://doi.org/10.1016/S0021-9673(01)82926-5
. [all data]
Bemgard, Colmsjo, et al., 1992
Bemgard, A.; Colmsjo, A.; Lundmark, B.-O.,
Gas chromatographic analysis of high-molecular-weight polynuclear aromatic hydrocarbons. I. Molecular weight 328,
J. Chromatogr., 1992, 595, 1-2, 247-258, https://doi.org/10.1016/0021-9673(92)85167-R
. [all data]