Cyclodecasiloxane, eicosamethyl-

Normal alkane RI, non-polar column, temperature ramp

View large format table.

Column type Active phase I Reference Comment
CapillaryMethyl Silicone2029.Fujimoto, Ohtani, et al., 199025. m/0.25 mm/0.1 μm, He, 5. K/min; Tstart: 40. C; Tend: 350. C

Normal alkane RI, non-polar column, custom temperature program

View large format table.

Column type Active phase I Reference Comment
CapillaryUltra-12023.Kazuyoshi, Seiichi, et al., 200030. m/0.25 mm/0.50 μm; Program: 40 0C (5 min) 10 0C/min -> 200 0C 20 0C/min -> 320 0C (13 min)
CapillaryUltra-12025.Kazuyoshi, Seiichi, et al., 200030. m/0.25 mm/0.50 μm; Program: 40 0C (5 min) 10 0C/min -> 200 0C 20 0C/min -> 320 0C (13 min)
CapillaryUltra-12030.Kazuyoshi, Seiichi, et al., 200030. m/0.25 mm/0.50 μm; Program: 40 0C (5 min) 10 0C/min -> 200 0C 20 0C/min -> 320 0C (13 min)
CapillaryUltra-12033.Kazuyoshi, Seiichi, et al., 200030. m/0.25 mm/0.50 μm; Program: 40 0C (5 min) 10 0C/min -> 200 0C 20 0C/min -> 320 0C (13 min)
CapillaryUltra-12033.Kazuyoshi, Seiichi, et al., 200030. m/0.25 mm/0.50 μm; Program: 40 0C (5 min) 10 0C/min -> 200 0C 20 0C/min -> 320 0C (13 min)
CapillaryUltra-12037.Kazuyoshi, Seiichi, et al., 200030. m/0.25 mm/0.50 μm; Program: 40 0C (5 min) 10 0C/min -> 200 0C 20 0C/min -> 320 0C (13 min)

References

Fujimoto, Ohtani, et al., 1990
Fujimoto, S.; Ohtani, H.; Yamagiwa, K.; Tsuge, S., Study on retention behavior of cyclic siloxanes by high resolution pyrolysis-gas chromatography with a fused silica capillary column, J. Hi. Res. Chromatogr., 1990, 13, 6, 397-404, https://doi.org/10.1002/jhrc.1240130603 . [all data]

Kazuyoshi, Seiichi, et al., 2000
Kazuyoshi, N.; Seiichi, Y.; Kazuo, K.; Katsumi, I.; Okihiko, S., Polymer analysis by improved pyrolysis gas chromatography hyphenated with four specific detectors, J. Soc. Cosmet. Chem. Jpn., 2000, 34, 2, 142-151, https://doi.org/10.5107/sccj.34.142 . [all data]