Phosphine, tris(4-fluorophenyl)-

Gas phase ion energetics data

Data compiled by: Sharon G. Lias, Rhoda D. Levin, and Sherif A. Kafafi

Ionization energy determinations

IE (eV) Method Reference Comment
8.12PEWeiner, Lattman, et al., 1975Vertical value

References

Weiner, Lattman, et al., 1975
Weiner, M.A.; Lattman, M.; Grim, S.O., Ultraviolet photoelectron spectra of some substituted triarylphosphines, J. Org. Chem., 1975, 40, 1292. [all data]