Methanol, TMS derivative

Gas phase ion energetics data

Data evaluated as indicated in comments:
HL - Edward P. Hunter and Sharon G. Lias

Data compiled as indicated in comments:
LBLHLM - Sharon G. Lias, John E. Bartmess, Joel F. Liebman, John L. Holmes, Rhoda D. Levin, and W. Gary Mallard
RDSH - Henry M. Rosenstock, Keith Draxl, Bruce W. Steiner, and John T. Herron

Quantity Value Units Method Reference Comment
Proton affinity (review)847.0kJ/molN/AHunter and Lias, 1998HL
Quantity Value Units Method Reference Comment
Gas basicity814.6kJ/molN/AHunter and Lias, 1998HL

Ionization energy determinations

IE (eV) Method Reference Comment
9.61PEMolder, Pikver, et al., 1983LBLHLM
9.79 ± 0.04EIHess, Lampe, et al., 1965RDSH

Appearance energy determinations

Ion AE (eV) Other Products MethodReferenceComment
C3H9OSi+10.25 ± 0.05CH3EIHess, Lampe, et al., 1965RDSH
C3H9Si+12.43 ± 0.18?EIHess, Lampe, et al., 1965RDSH

Phase change data

Data compiled by: Robert L. Brown and Stephen E. Stein

Quantity Value Units Method Reference Comment
Tboil330. - 331.KN/APCR Inc., 1990

Kovats' RI, non-polar column, isothermal

View large format table.

Column type Active phase Temperature (C) I Reference Comment
PackedApiezon M160.506.Peetre, Ellren, et al., 1985Chromosorb G; Column length: 3. m

Normal alkane RI, non-polar column, isothermal

View large format table.

Column type Active phase Temperature (C) I Reference Comment
PackedApieson M160.506.Ellren, Peetre, et al., 1974Chromosorb G AW DMCS (80-100 mesh)

Normal alkane RI, non-polar column, temperature ramp

View large format table.

Column type Active phase I Reference Comment
CapillaryOV-101562.Zenkevich, 200525. m/0.20 mm/0.10 μm, N2/He, 6. K/min; Tstart: 50. C; Tend: 250. C
CapillaryHP-5563.Jung, Wichmann, et al., 199925. m/0.20 mm/0.33 μm, 50. C @ 3. min, 5. K/min; Tend: 180. C

References

Hunter and Lias, 1998
Hunter, E.P.; Lias, S.G., Evaluated Gas Phase Basicities and Proton Affinities of Molecules: An Update, J. Phys. Chem. Ref. Data, 1998, 27, 3, 413-656, https://doi.org/10.1063/1.556018 . [all data]

Molder, Pikver, et al., 1983
Molder, U.H.; Pikver, R.J.; Koppel, I.A., Photoelectron spectra of molecules. 2. Ethers, Org. React. (N.Y. Engl. Transl.), 1983, 20, 208. [all data]

Hess, Lampe, et al., 1965
Hess, G.G.; Lampe, F.W.; Sommer, L.H., An electron impact study of ionization and dissociation of trimethylsilanes, J. Am. Chem. Soc., 1965, 87, 5327. [all data]