Butanamide, N-methyl-

Gas phase ion energetics data

Data compiled by: Sharon G. Lias, Rhoda D. Levin, and Sherif A. Kafafi

Ionization energy determinations

IE (eV) Method Reference
9.68 ± 0.05EIThorstad, Undheim, et al., 1975

Kovats' RI, non-polar column, isothermal

Data compiled by: NIST Mass Spectrometry Data Center, William E. Wallace, director

Column type Packed
Active phase SE-30
Column length (m) 1.
Carrier gas N2
Substrate Chromosorb W AW
Column diameter (mm)
Phase thickness (μm)
Temperature (C) 180.
I 1005.
ReferenceKrawczyk and Piotrowski, 1989
Comment MSDC-RI

Condensed phase thermochemistry data

Data compiled by: Eugene S. Domalski and Elizabeth D. Hearing

Constant pressure heat capacity of liquid

Cp,liquid (cal/mol*K) Temperature (K) Reference
49.5298.15Konicek and Wadso, 1971

References

Thorstad, Undheim, et al., 1975
Thorstad, O.; Undheim, K.; El-Gendy, M.A.F., Ionisation potentials in structure analysis of isomeric nitrones, oxaziranes, O-ether oximes acid amides, Org. Mass Spectrom., 1975, 10, 1155. [all data]