1-Eicosanol, 2-hexadecyl-

Van Den Dool and Kratz RI, non-polar column, temperature ramp

Data compiled by: NIST Mass Spectrometry Data Center, William E. Wallace, director

Column type Capillary
Active phase Ultra-1
Column length (m) 12.5
Carrier gas He
Substrate
Column diameter (mm) 0.20
Phase thickness (μm) 0.11
Tstart (C) 120.
Tend (C) 325.
Heat rate (K/min) 5.
Initial hold (min)
Final hold (min) 5.
I 3782.
ReferenceTokuda, Saitoh, et al., 1988
Comment MSDC-RI

References

Tokuda, Saitoh, et al., 1988
Tokuda, H.; Saitoh, E.; Kimura, Y.; Takano, S., Automated analysis of various compounds with a wide range of boiling points by capillary gas chromatgraphy based on retention indices, J. Chromatogr., 1988, 454, 109-120, https://doi.org/10.1016/S0021-9673(00)88606-9 . [all data]