L-Phenylalanine, N,N-dimethyl-
- Formula: C11H15NO2
- Molecular weight: 193.2423
- IUPAC Standard InChIKey: HOGIQTACRLIOHC-JTQLQIEISA-N
- CAS Registry Number: 17469-89-5
- Chemical structure:
View 3d structure (requires JavaScript / HTML 5) - Other names: Alanine, N,N-dimethyl-3-phenyl-, L-; N,N-Dimethylphenylalanine; Phenylalanine, N,N-dimethyl-

Gas phase ion energetics data

Data compiled by: Sharon G. Lias and Joel F. Liebman
Ionization energy determinations
IE (eV) | Method | Reference | Comment |
---|---|---|---|
7.7 | PE | Campbell, Marzluff, et al., 1994 | |
8.2 | PE | Campbell, Marzluff, et al., 1994 | Vertical value |

References

Campbell, Marzluff, et al., 1994
Campbell, S.; Marzluff, E.M.; Rodgers, M.T.; Beauchamp, J.L.; Rempe, M.E.; Schwinck, K.F.; Lichtenberger, D.L.,
Proton affinities and photoelectron spectra of phenylalanine and N-methyl and N,N-dimethylphenylalanine. Correlation of lone pair ionization energies with proton affinities and implications for N-methylation as a method to effect site specific protonation of peptides,
J. Am. Chem. Soc., 1994, 116, 5257. [all data]