Nonadecanoic acid, methyl ester

Lee's RI, non-polar column, custom temperature program

Data compiled by: NIST Mass Spectrometry Data Center, William E. Wallace, director

Column type Capillary
Active phase DB-5
Column length (m) 30.
Carrier gas N2
Substrate
Column diameter (mm) 0.25
Phase thickness (μm) 0.215
Program not specified
I 365.43
ReferenceWang, Jin, et al., 1992
Comment MSDC-RI

Kovats' RI, non-polar column, isothermal

View large format table.

Column type Active phase Temperature (C) I Reference Comment
CapillaryOV-101170.2197.7Kittiratanapiboon, Jeyashoke, et al., 199815. m/0.25 mm/0.2 μm, N2
CapillaryOV-101175.2198.8Kittiratanapiboon, Jeyashoke, et al., 199815. m/0.25 mm/0.2 μm, N2
CapillaryOV-101180.2200.Kittiratanapiboon, Jeyashoke, et al., 199815. m/0.25 mm/0.2 μm, N2
CapillaryOV-101185.2201.2Kittiratanapiboon, Jeyashoke, et al., 199815. m/0.25 mm/0.2 μm, N2
CapillaryOV-101190.2202.4Kittiratanapiboon, Jeyashoke, et al., 199815. m/0.25 mm/0.2 μm, N2
CapillaryOV-101195.2203.6Kittiratanapiboon, Jeyashoke, et al., 199815. m/0.25 mm/0.2 μm, N2
CapillaryOV-101200.2204.9Kittiratanapiboon, Jeyashoke, et al., 199815. m/0.25 mm/0.2 μm, N2
CapillaryCP Sil 5 CB240.2210.Hanai and Hong, 198930. m/0.25 mm/0.25 μm
CapillaryDB-1240.2211.Hanai and Hong, 198930. m/0.25 mm/0.25 μm
PackedSE-30200.2214.Golovnya and Kuzmenko, 1977He, Chromosorb W (80-100 mesh); Column length: 1.5 m
PackedSE-30200.2214.Golovnya, Uralets, et al., 1976Gas Chrom Q (80-100 mesh); Column length: 1.5 m

Kovats' RI, polar column, isothermal

View large format table.

Column type Active phase Temperature (C) I Reference Comment
CapillaryCP-Wax240.2513.Hanai and Hong, 198925. m/0.25 mm/0.22 μm
CapillaryDB-Wax240.2543.Hanai and Hong, 198925. m/0.25 mm/0.22 μm

Van Den Dool and Kratz RI, non-polar column, temperature ramp

View large format table.

Column type Active phase I Reference Comment
CapillaryDB-12209.Johnson, Urso, et al., 199730. m/0.2 mm/0.25 μm, 50. C @ 2. min, 5. K/min, 300. C @ 5. min
CapillaryDB-12210.Johnson, Urso, et al., 199730. m/0.2 mm/0.25 μm, 50. C @ 2. min, 5. K/min, 300. C @ 5. min
CapillaryDB-52228.Rostad and Pereira, 198630. m/0.26 mm/0.25 μm, He, 50. C @ 4. min, 6. K/min, 300. C @ 20. min

Van Den Dool and Kratz RI, non-polar column, custom temperature program

View large format table.

Column type Active phase I Reference Comment
CapillaryVF-5MS2226.2Tret'yakov, 200830. m/0.25 mm/0.25 μm, He; Program: Multi-step temperature program; T(initial)=60C; T(final)=270C
CapillaryDB-12210.Peng, 200015. m/0.53 mm/1. μm, He; Program: 40C(3min) => 8C/min => 200(1min) => 5C/min => 300C(25min)

Van Den Dool and Kratz RI, polar column, temperature ramp

View large format table.

Column type Active phase I Reference Comment
CapillaryDB-Wax2534.Peng, 200015. m/0.53 mm/1. μm, He, 40. C @ 3. min, 5. K/min, 220. C @ 30. min
CapillaryHP-Wax2539.Peng, 200015. m/0.53 mm/1. μm, He, 40. C @ 3. min, 5. K/min, 220. C @ 30. min

Normal alkane RI, non-polar column, isothermal

View large format table.

Column type Active phase Temperature (C) I Reference Comment
CapillaryDB-1200.2210.Aryusuk and Krisnangkura, 2003

Normal alkane RI, non-polar column, temperature ramp

View large format table.

Column type Active phase I Reference Comment
CapillaryHP-5 MS2221.Vedernikov, Shabanova, et al., 201130. m/0.25 mm/0.25 μm, Helium, 5. K/min, 280. C @ 5. min; Tstart: 150. C
CapillaryRTx-12209.Dib, Bendahou, et al., 201060. m/0.22 mm/0.25 μm, Helium, 2. K/min, 230. C @ 35. min; Tstart: 60. C
CapillaryHP-12207.Amijee, Cheung, et al., 199612. m/0.22 mm/33. μm, He, 140. C @ 0.5 min, 20. K/min, 300. C @ 3. min
CapillaryDB-52230.Wang, Jin, et al., 199230. m/0.25 mm/0.215 μm, N2, 50. C @ 4. min, 6. K/min, 300. C @ 20. min
CapillaryUltra-12209.Okumura, 199125. m/0.32 mm/0.25 μm, He, 3. K/min; Tstart: 80. C; Tend: 260. C

Normal alkane RI, non-polar column, custom temperature program

View large format table.

Column type Active phase I Reference Comment
CapillaryRTx-12207.Dib, Bendahou, et al., 201060. m/0.22 mm/0.25 μm, Helium; Program: not specified
CapillaryDB-52228.Wang, Jin, et al., 199230. m/0.25 mm/0.215 μm, N2; Program: not specified

Lee's RI, non-polar column, temperature ramp

View large format table.

Column type Active phase I Reference Comment
CapillaryDB-1376.6Johnson, Urso, et al., 199730. m/0.2 mm/0.25 μm, 50. C @ 2. min, 5. K/min, 300. C @ 5. min
CapillaryDB-1376.7Johnson, Urso, et al., 199730. m/0.2 mm/0.25 μm, 50. C @ 2. min, 5. K/min, 300. C @ 5. min
CapillaryDB-5365.54Wang, Jin, et al., 199230. m/0.25 mm/0.215 μm, N2, 50. C @ 4. min, 6. K/min, 300. C @ 20. min
CapillaryDB-5365.43Rostad and Pereira, 198630. m/0.26 mm/0.25 μm, He, 50. C @ 4. min, 6. K/min, 300. C @ 20. min

References

Wang, Jin, et al., 1992
Wang, X.; Jin, Z.; Xu, X., Analysis of fatty acids in bacteria by using gas chromatographic retention indices, Chin. J. Chromatogr., 1992, 10, 2, 92-94. [all data]