Germacyclopent-3-ene,1,1-dimethyl-

Gas phase ion energetics data

Data compiled by: Sharon G. Lias, Rhoda D. Levin, and Sherif A. Kafafi

Ionization energy determinations

IE (eV) Method Reference Comment
9.0PESchweig, Weidner, et al., 1972Vertical value

References

Schweig, Weidner, et al., 1972
Schweig, A.; Weidner, U.; Manuel, G., Photoelektronen-Spektroskopie und transannulare Wechselwirkungen - Zur Frage transannularer d-π-Wechselwirkung in 1-Sila- und 1-Germa-3- cyclopentenen, Angew. Chem., 1972, 84, 899. [all data]