2-Cyclohexen-1-one, 3,4,4-trimethyl-

Normal alkane RI, non-polar column, custom temperature program

View large format table.

Column type Active phase I Reference Comment
CapillaryDB-51198.Isidorov, Zenkevich, et al., 1997Program: not specified

Normal alkane RI, polar column, custom temperature program

View large format table.

Column type Active phase I Reference Comment
CapillaryHP-Innowax1720.Sun, Hua, et al., 201030. m/0.32 mm/0.50 μm, Helium; Program: 50 0C (5 min) 3 0C/min -> 210 0C (10 min) 3 0C/min -> 230 0C

References

Isidorov, Zenkevich, et al., 1997
Isidorov, V.; Zenkevich, I.; Sacharevich, T., Calculation of Gas Chromatographic Retention Indices for Monoterpenes and Terpenoids from Their Physico-Chemical Constants, Chem. Anal. (Warsaw), 1997, 42, 627-634. [all data]

Sun, Hua, et al., 2010
Sun, Q.-L.; Hua, S.; Ye, J.-H.; Zheng, X.-Q.; Liang, Y.-R., Flavonoids and volatiles in Chrysanthemum morifolium Ramat flower from Tongxiang County in China, Afr. J. Biotechnol., 2010, 9, 25, 3817-3821. [all data]