1-Methyl-4-n-hexylbenzene

Kovats' RI, non-polar column, isothermal

View large format table.

Column type Active phase Temperature (C) I Reference Comment
CapillarySqualane100.1333.Engewald and Wennrich, 1976N2; Column length: 100. m; Column diameter: 0.23 mm

Kovats' RI, polar column, isothermal

View large format table.

Column type Active phase Temperature (C) I Reference Comment
CapillaryCarbowax 20M100.1579.6Engewald and Wennrich, 1976N2; Column length: 100. m; Column diameter: 0.23 mm

Normal alkane RI, polar column, isothermal

View large format table.

Column type Active phase Temperature (C) I Reference Comment
CapillaryPEG-40M100.1601.Nesterov, Nesterova, et al., 2000Column length: 50. m
CapillaryPEG-40M100.1601.Nesterov, Nesterova, et al., 2000Column length: 50. m
CapillaryPEG-40M120.1615.Nesterov, Nesterova, et al., 2000Column length: 50. m
CapillaryPEG-40M140.1629.Nesterov, Nesterova, et al., 2000Column length: 50. m
CapillaryPEG-40M160.1643.Nesterov, Nesterova, et al., 2000Column length: 50. m
CapillaryPEG-40M80.1589.Nesterov, Nesterova, et al., 2000Column length: 50. m
CapillaryCarbowax 20M90.1571.Sutter, Peterson, et al., 1997

Normal alkane RI, polar column, custom temperature program

View large format table.

Column type Active phase I Reference Comment
CapillaryCarbowax 20M1571.Ivanciuc, Ivanciuc, et al., 2001Program: not specified

References

Engewald and Wennrich, 1976
Engewald, W.; Wennrich, L., Molekülstruktur und Retentionsverhalten. VIII. Zum Retentionsverhalten höherer Alkylbenzole bei der Gas-Verteilungs-Chromatographie, Chromatographia, 1976, 9, 11, 540-547, https://doi.org/10.1007/BF02275960 . [all data]

Nesterov, Nesterova, et al., 2000
Nesterov, I.A.; Nesterova, T.N.; Pimerzin, A.A.; Tsvetkov, V.S., Thermodynamics of alkylbenzene sorption and evaporation. IV. Enthalpies of evaporation and thermodynamics chracteristics of sorption by stationary phases OV-101 and PEG-40M, Izvestia vysshikh uchebnykh zavedenii. Khimia i khimicheskaia tekhnologia (Chemistry and chemical technology), 2000, 43, 4, 39-45. [all data]

Sutter, Peterson, et al., 1997
Sutter, J.M.; Peterson, T.A.; Jurs, P.C., Prediction of gas chromatographic retention indices of alkylbenzenes, Anal. Chim. Acta., 1997, 342, 2-3, 113-122, https://doi.org/10.1016/S0003-2670(96)00578-8 . [all data]

Ivanciuc, Ivanciuc, et al., 2001
Ivanciuc, O.; Ivanciuc, T.; Klein, D.J.; Seitz, W.A.; Balaban, A.T., Quantitative structure-retention relationships for gas chromatographic retention indices of alkylbenzenes with molecular graph descriptors, SAR QSAR Environ. Res., 2001, 11, 5-6, 419-452, https://doi.org/10.1080/10629360108035362 . [all data]