1H-Isoindole-1,3(2H)-dione, 2-[1,1'-biphenyl]-4-yl-

Gas phase ion energetics data

Data compiled by: Henry M. Rosenstock, Keith Draxl, Bruce W. Steiner, and John T. Herron

Ionization energy determinations

IE (eV) Method Reference
8.4EICotter and Dine-Hart, 1966

References

Cotter and Dine-Hart, 1966
Cotter, J.L.; Dine-Hart, R.A., Ionization and dissociation of some aromatic imides under electron impact, Chem. Commun., 1966, 809. [all data]