Cyclohexanone, 2-(thioacetyl)-

Gas phase ion energetics data

Data compiled as indicated in comments:
LLK - Sharon G. Lias, Rhoda D. Levin, and Sherif A. Kafafi

Ionization energy determinations

IE (eV) Method Reference Comment
7.8PEJorgensen, Carlsen, et al., 1981LLK
8.08PEJorgensen, Carlsen, et al., 1981Vertical value; LLK

References

Jorgensen, Carlsen, et al., 1981
Jorgensen, F.S.; Carlsen, L.; Duus, F., The electronic structure of β-thioxoketones. A photoelectron spectroscopic study of the enol-enethiol tautomerism of thioacetylacetone and related compounds, J. Am. Chem. Soc., 1981, 103, 1350. [all data]