Phenanthrene-D10
- Formula: C14D10
- Molecular weight: 188.2908
- IUPAC Standard InChIKey: YNPNZTXNASCQKK-LHNTUAQVSA-N
- CAS Registry Number: 1517-22-2
- Chemical structure:
View 3d structure (requires JavaScript / HTML 5) - Species with the same structure:
- Isotopologues:
- Other names: Phenanthrene, perdeutero-; [2H10]Phenanthrene

Normal alkane RI, non-polar column, custom temperature program

Column type | Active phase | I | Reference | Comment |
---|---|---|---|---|
Capillary | HP-5MS | 1776. | Vichi, Pizzale, et al., 2005 | 30. m/0.25 mm/0.25 μm; Program: 40C(3min) => 4C/min => 75C => 8C/min => 250C |
Capillary | Polydimethyl siloxane, unknown content of Ph-groups | 1793. | Geldon, 1989 | Program: not specified |

Normal alkane RI, polar column, custom temperature program

Column type | Active phase | I | Reference | Comment |
---|---|---|---|---|
Capillary | Supelcowax-10 | 2713. | Vichi, Pizzale, et al., 2005 | 30. m/0.25 mm/0.25 μm; Program: 40C(3min) => 4C/min => 75C => 8C/min => 250C |

Lee's RI, non-polar column, temperature ramp

Column type | Active phase | I | Reference | Comment |
---|---|---|---|---|
Capillary | DB-5 | 299.2 | Donnelly, Abdel-Hamid, et al., 1993 | 30. m/0.32 mm/0.25 μm, He, 40. C @ 3. min, 8. K/min, 285. C @ 29.5 min |

Phase change data

Data compiled by: William E. Acree, Jr., James S. Chickos
Quantity | Value | Units | Method | Reference | Comment |
---|---|---|---|---|---|
ΔvapH° | 78.6 | kJ/mol | CGC | Zhao, Unhannanant, et al., 2008 |
Enthalpy of sublimation
ΔsubH (kJ/mol) | Temperature (K) | Method | Reference | Comment |
---|---|---|---|---|
92.2 ± 1.1 | 303. | GS | Sonnefeld, Zoller, et al., 1983 | Based on data from 283. to 323. K. |

Gas phase ion energetics data

Data compiled by: Henry M. Rosenstock, Keith Draxl, Bruce W. Steiner, and John T. Herron
Ionization energy determinations
IE (eV) | Method | Reference |
---|---|---|
8.05 | EI | Nounou, 1968 |

References

Vichi, Pizzale, et al., 2005
Vichi, S.; Pizzale, L.; Conte, L.S.; Buxaderas, S.; L´opez-Tamames, E.,
Simultaneous determination of volatile and semi-volatile aromatic hydrocarbons in virgin olive oil by headspace solid-phase microextraction coupled to gas chromatography/mass spectrometry,
J. Chromatogr. A, 2005, 1090, 1-2, 146-154, https://doi.org/10.1016/j.chroma.2005.07.007
. [all data]
Geldon, 1989
Geldon, A.L.,
Ground Water Hydrology of the Central Raton Basin, Colorado and New Mexico, US Geological Survey, US Government Printing Office, 1989, 104. [all data]
Donnelly, Abdel-Hamid, et al., 1993
Donnelly, J.R.; Abdel-Hamid, M.S.; Jeter, J.L.; Gurka, D.F.,
Application of gas chromatographic retention properties to the identification of environmental contaminants,
J. Chromatogr., 1993, 642, 1-2, 409-415, https://doi.org/10.1016/0021-9673(93)80106-I
. [all data]