Piperidine, 1,1'-(1,4-phenylenedicarbonyl)bis-

Gas phase ion energetics data

Data compiled by: Sharon G. Lias, Rhoda D. Levin, and Sherif A. Kafafi

Ionization energy determinations

IE (eV) Method Reference
8.8EIBohlmann, Herrmann, et al., 1974

Appearance energy determinations

Ion AE (eV) Other Products MethodReferenceComment
C13H14NO2+12.7?EIBohlmann, Herrmann, et al., 1974

References

Bohlmann, Herrmann, et al., 1974
Bohlmann, F.; Herrmann, R.; Mathar, W.; Schwarz, H., Massenspektrometrische untersuchung von amiden. VII. Intramolekulare washselwirkungen bifunktioneller gruppen bei der elektronenstoβinduzierten fragmentierung von piperididen und piperideiden, Chem. Ber., 1974, 107, 1081. [all data]