2-Propenal, 3-(2-methoxyphenyl)-

Van Den Dool and Kratz RI, non-polar column, temperature ramp

View large format table.

Column type Active phase I Reference Comment
PackedSE-301512.van den Dool and Kratz, 1963Celite; Tstart: 75. C; Tend: 228. C

Normal alkane RI, non-polar column, temperature ramp

View large format table.

Column type Active phase I Reference Comment
CapillaryDB-5MS1505.Marongiu B., Piras A., et al., 200730. m/0.25 mm/0.25 μm, He, 3. K/min, 280. C @ 30. min; Tstart: 60. C

Normal alkane RI, non-polar column, custom temperature program

View large format table.

Column type Active phase I Reference Comment
CapillarySE-301504.Vinogradov, 2004Program: not specified

Normal alkane RI, polar column, custom temperature program

View large format table.

Column type Active phase I Reference Comment
CapillaryCarbowax 20M2430.Vinogradov, 2004Program: not specified

References

van den Dool and Kratz, 1963
van den Dool, H.; Kratz, P. Dec., A generalization of the retention index system including linear temperature programmed gas-liquid partition chromatography, J. Chromatogr., 1963, 11, 463-471, https://doi.org/10.1016/S0021-9673(01)80947-X . [all data]

Marongiu B., Piras A., et al., 2007
Marongiu B.; Piras A.; Porcedda S.; Tuveri E.; Sanjust E.; Meli M.; Sollai F.; Zucca P.; Rescigno A., Supercritical CO2 extract of Cinnamomum zeylanicum: Chemical characterization and antityrosinase activity, J. Agric. Food Chem., 2007, 55, 24, 10022-10027, https://doi.org/10.1021/jf071938f . [all data]

Vinogradov, 2004
Vinogradov, B.A., Production, composition, properties and application of essential oils, 2004, retrieved from http://viness.narod.ru. [all data]