Allylphosphonic dichloride

Gas phase ion energetics data

Data compiled by: Sharon G. Lias, Rhoda D. Levin, and Sherif A. Kafafi

Ionization energy determinations

IE (eV) Method Reference Comment
10.54PEZverev, Villem, et al., 1978Vertical value

References

Zverev, Villem, et al., 1978
Zverev, V.V.; Villem, Y.Y.; Ermolaeva, L.V.; Lisin, A.F., The photoelectron spectra and electronic structure of unsaturated phosphoryl compounds, Dokl. Phys. Chem., 1978, 246, 1368. [all data]