ClCH2(CH2)3C(O)OCH3

Kovats' RI, non-polar column, isothermal

View large format table.

Column type Active phase Temperature (C) I Reference Comment
CapillarySE-30100.1045.Haken and Korhonen, 1984N2; Column length: 25. m; Column diameter: 0.22 mm
PackedE-301170.1057.Shashkova, Znamenskaia, et al., 1969He, Celite 545 (0.20-0.50 mm); Column length: 2. m

Kovats' RI, polar column, isothermal

View large format table.

Column type Active phase Temperature (C) I Reference Comment
CapillaryCarbowax 20M100.1556.Haken and Korhonen, 1984N2; Column length: 22. m; Column diameter: 0.3 mm
CapillaryCarbowax 20M120.1597.Haken and Korhonen, 1984N2; Column length: 22. m; Column diameter: 0.3 mm
PackedPolyethylene Glycol170.1631.Shashkova, Znamenskaia, et al., 1969He, Celite 545 (0.20-0.50 mm); Column length: 2. m

Van Den Dool and Kratz RI, non-polar column, custom temperature program

View large format table.

Column type Active phase I Reference Comment
Capillary5 % Phenyl methyl siloxane1061.8Zaikin, 2003Column length: 30. m; Column diameter: 0.19 mm; Program: 50 C to 120 C at 5 C/min; 120 C to 290 C at 12 C/min

References

Haken and Korhonen, 1984
Haken, J.K.; Korhonen, I.O.O., Gas chromatography of homologous esters. XXV. Capillary column studies of monochlorinated C5-C18 n-carboxylic esters, J. Chromatogr., 1984, 298, 89-100, https://doi.org/10.1016/S0021-9673(01)92697-4 . [all data]

Shashkova, Znamenskaia, et al., 1969
Shashkova, A.A.; Znamenskaia, A.P.; Pas'ko, L.Ya., Investigation of esters of odd series halohenated acids with Kovats indices, Gazovaya Khromatografiya, 1969, 9, 40-47. [all data]

Zaikin, 2003
Zaikin, V.G., Personal Communication: Retention indices measured during the period 2001 to 2003, 2003. [all data]