2-(4-Azulyl)ethanol

Gas phase ion energetics data

Data compiled by: Henry M. Rosenstock, Keith Draxl, Bruce W. Steiner, and John T. Herron

Ionization energy determinations

IE (eV) Method Reference
7.1EICooks, Wolfe, et al., 1970

Appearance energy determinations

Ion AE (eV) Other Products MethodReferenceComment
C12H11+10.3OHEICooks, Wolfe, et al., 1970
C12H11O+10.3HEICooks, Wolfe, et al., 1970

References

Cooks, Wolfe, et al., 1970
Cooks, R.G.; Wolfe, N.L.; Curtis, J.R.; Petty, H.E.; McDonald, R.N., Neighboring-group participation reactions in the mass spectral fragmentations of some azulenes. Comparisons with solvolytic processes, J.Org. Chem., 1970, 35, 4048. [all data]