Salicin

Van Den Dool and Kratz RI, non-polar column, temperature ramp

View large format table.

Column type Active phase I Reference Comment
CapillaryMethyl Silicone2572.Greenaway and Whatley, 199025. m/0.32 mm/0.5 μm, He, 3. K/min; Tstart: 75. C; Tend: 300. C
CapillaryMethyl Silicone2579.Greenaway and Whatley, 199025. m/0.32 mm/0.5 μm, He, 3. K/min; Tstart: 75. C; Tend: 300. C

References

Greenaway and Whatley, 1990
Greenaway, W.; Whatley, F.R., Resolution of complex mixtures of phenolics in poplar bud exudate by analysis of gas chromatography-mass spectrometry data, J. Chromatogr., 1990, 519, 1, 145-158, https://doi.org/10.1016/0021-9673(90)85143-J . [all data]