9,9-Dimethyl-9-silafluorene

Gas phase ion energetics data

Data compiled as indicated in comments:
LLK - Sharon G. Lias, Rhoda D. Levin, and Sherif A. Kafafi

Ionization energy determinations

IE (eV) Method Reference Comment
7.4PESchweig, Weidner, et al., 1973LLK
7.9PESchweig, Weidner, et al., 1973Vertical value; LLK

References

Schweig, Weidner, et al., 1973
Schweig, A.; Weidner, U.; Hellwinkel, D.; Krapp, W., Spiroconjugation, Angew. Chem. Int. Ed. Engl., 1973, 12, 310. [all data]