10-Octadecenoic acid, methyl ester
- Formula: C19H36O2
- Molecular weight: 296.4879
- IUPAC Standard InChIKey: HHZIOLLKZWLCOX-MDZDMXLPSA-N
- CAS Registry Number: 13481-95-3
- Chemical structure:
View 3d structure (requires JavaScript / HTML 5) - Other names: Methyl 10-octadecenoate

Normal alkane RI, non-polar column, temperature ramp

Column type | Active phase | I | Reference | Comment |
---|---|---|---|---|
Capillary | DB-5 | 2110. | Wang, Jin, et al., 1992 | 30. m/0.25 mm/0.215 μm, N2, 50. C @ 4. min, 6. K/min, 300. C @ 20. min |

Normal alkane RI, non-polar column, custom temperature program

Column type | Active phase | I | Reference | Comment |
---|---|---|---|---|
Capillary | 5 % Phenyl methyl siloxane | 2100. | Huang, Qin, et al., 2009 | 30. m/0.25 mm/0.25 μm, Helium; Program: 50 0C (2 min) 10 0C/min -> 150 0C 15 0C/min -> 300 0C (10 min) |

Lee's RI, non-polar column, temperature ramp

Column type | Active phase | I | Reference | Comment |
---|---|---|---|---|
Capillary | DB-5 | 348.32 | Wang, Jin, et al., 1992 | 30. m/0.25 mm/0.215 μm, N2, 50. C @ 4. min, 6. K/min, 300. C @ 20. min |

References

Wang, Jin, et al., 1992
Wang, X.; Jin, Z.; Xu, X.,
Analysis of fatty acids in bacteria by using gas chromatographic retention indices,
Chin. J. Chromatogr., 1992, 10, 2, 92-94. [all data]
Huang, Qin, et al., 2009
Huang, B.; Qin, L.; Chu, Q.; Zhang, Q.; Gao, L.; Zheng, H.,
Comparison of headspace SPME with hydrodistillation and SFE for analysis of the volatile components of the roots of Valeriana officinalis var. latifolia,
Chromatographia, 2009, 69, 5/6, 489-496, https://doi.org/10.1365/s10337-008-0921-y
. [all data]