Benzyl (E)-ferulate
- Formula: C17H16O4
- Molecular weight: 284.3065
- IUPAC Standard InChIKey: DZAPHTCUSDTZAT-CSKARUKUSA-N
- CAS Registry Number: 132335-97-8
- Chemical structure:
- Other names: (E)-Benzyl 3-(4-hydroxy-3-methoxyphenyl)acrylate; 2-Propenoic acid, 3-(4-hydroxy-3-methoxyphenyl)-, phenylmethyl ester, (2E)-

Van Den Dool and Kratz RI, non-polar column, custom temperature program

Column type | Active phase | I | Reference | Comment |
---|---|---|---|---|
Capillary | HP-5MS | 2596.2 | Andriamaharavo, 2014 | 30. m/0.25 mm/0.25 μm, He; Program: 60C (1 min) => 5 C/min => 210C => 10 C/min => 280C (15 min) |

References

Andriamaharavo, 2014
Andriamaharavo, N.R.,
Retention Data. NIST Mass Spectrometry Data Center., NIST Mass Spectrometry Data Center, 2014. [all data]