9,19-Cyclolanostan-3-ol, 24-methylene-, acetate, (3β)-

Van Den Dool and Kratz RI, non-polar column, temperature ramp

View large format table.

Column type Active phase I Reference Comment
CapillaryOV-1013365.Stankovic, Bastic, et al., 1985H2, 2. K/min; Column length: 30. m; Column diameter: 0.3 mm; Tstart: 160. C; Tend: 300. C

References

Stankovic, Bastic, et al., 1985
Stankovic, S.K.; Bastic, M.B.; Jovanovic, J.A., Composition of the triterpene alcohol fraction of horse chestnut seed, Phytochemistry, 1985, 24, 1, 119-121, https://doi.org/10.1016/S0031-9422(00)80819-5 . [all data]