Silicon monosulfide
- Formula: SSi
- Molecular weight: 60.150
- IUPAC Standard InChIKey: DWFFKGPZNGKUPH-UHFFFAOYSA-N
- CAS Registry Number: 12504-41-5
- Chemical structure:
View 3d structure (requires JavaScript / HTML 5) - Permanent link for this species. Use this link for bookmarking this species for future reference.

Gas phase ion energetics data

Data evaluated as indicated in comments:
HL - Edward P. Hunter and Sharon G. Lias
Data compiled as indicated in comments:
LL - Sharon G. Lias and Joel F. Liebman
Quantity | Value | Units | Method | Reference | Comment |
---|---|---|---|---|---|
Proton affinity (review) | 627. | kJ/mol | N/A | Hunter and Lias, 1998 | at Si; HL |
Proton affinity (review) | 683. | kJ/mol | N/A | Hunter and Lias, 1998 | at S; HL |
Quantity | Value | Units | Method | Reference | Comment |
Gas basicity | 596.6 | kJ/mol | N/A | Hunter and Lias, 1998 | at Si; HL |
Gas basicity | 660.2 | kJ/mol | N/A | Hunter and Lias, 1998 | at S; HL |
Ionization energy determinations
IE (eV) | Method | Reference | Comment |
---|---|---|---|
10.53 ± 0.02 | PE | Cockett, Dyke, et al., 1989 | LL |

Gas phase thermochemistry data

Quantity | Value | Units | Method | Reference | Comment |
---|---|---|---|---|---|
ΔfH°gas | 105.96 | kJ/mol | Review | Chase, 1998 | Data last reviewed in December, 1971 |
Quantity | Value | Units | Method | Reference | Comment |
S°gas,1 bar | 223.76 | J/mol*K | Review | Chase, 1998 | Data last reviewed in December, 1971 |
Gas Phase Heat Capacity (Shomate Equation)
Cp° = A + B*t + C*t2 + D*t3 +
E/t2
H° − H°298.15= A*t + B*t2/2 +
C*t3/3 + D*t4/4 − E/t + F − H
S° = A*ln(t) + B*t + C*t2/2 + D*t3/3 −
E/(2*t2) + G
Cp = heat capacity (J/mol*K)
H° = standard enthalpy (kJ/mol)
S° = standard entropy (J/mol*K)
t = temperature (K) / 1000.
View plot Requires a JavaScript / HTML 5 canvas capable browser.
Temperature (K) | 298. to 6000. |
---|---|
A | 35.66638 |
B | 2.187631 |
C | -0.784910 |
D | 0.110524 |
E | -0.362609 |
F | 94.02034 |
G | 264.2686 |
H | 105.9602 |
Reference | Chase, 1998 |
Comment | Data last reviewed in December, 1971 |

References

Hunter and Lias, 1998
Hunter, E.P.; Lias, S.G.,
Evaluated Gas Phase Basicities and Proton Affinities of Molecules: An Update,
J. Phys. Chem. Ref. Data, 1998, 27, 3, 413-656, https://doi.org/10.1063/1.556018
. [all data]
Cockett, Dyke, et al., 1989
Cockett, M.C.R.; Dyke, J.M.; Morris, A.; Niavaran, M.H.Z.,
High-temperature photoelectron spectroscopy A study of SiS(X +),
J. Chem. Soc. Faraday Trans. 2, 1989, 85, 75. [all data]